Issue 1391

For help and support with PS3 Media Server in general
Forum rules
Please make sure you follow the Problem Reporting Guidelines before posting if you want a reply.

Re: Issue 1391

Postby heavydawson » Tue May 21, 2013 5:04 pm

Thx meskibob,
Will grab a copy of trunk and build this evening to see what happens.
heavydawson
 
Posts: 6
Joined: Thu May 16, 2013 4:43 pm

Re: Issue 1391

Postby Raptor399 » Tue May 21, 2013 8:15 pm

Just in case I have made the commit, so it should be available in a snapshot build soon.
Thanks for the analysis, meskibob!
Raptor399
Project Member
 
Posts: 1916
Joined: Thu Mar 10, 2011 12:06 am

Re: Issue 1391

Postby heavydawson » Tue May 21, 2013 8:43 pm

Just tried building with Maven 3.0.5 there and got this error during artifact resolution:
C:\Users\user.name\Documents\GitHub\ps3mediaserver>c:\apache-maven-3.0.5\bin\mvn com.savage7.maven.plugins:maven-external-dependency-plugin:resolve-external
[INFO] Scanning for projects...
[INFO]
[INFO] ------------------------------------------------------------------------
[INFO] Building PS3 Media Server 1.82.0-SNAPSHOT
[INFO] ------------------------------------------------------------------------
[INFO]
[INFO] --- maven-external-dependency-plugin:0.5:resolve-external (default-cli) @ pms ---
[INFO] starting to resolve external dependencies
[INFO] attempting to resolve external artifact: com.jgoodies:common:1.2.1:jar
[INFO] downloading artifact from URL: http://www.jgoodies.com/download/librar ... -1_2_1.zip
[INFO] verifying checksum on downloaded file: CKSM=5a4cf9866a7339e64e52f46101b5b13fe50b9c80
[INFO] testing for MD5 checksum on artifact: com.jgoodies:common:1.2.1:jar
[INFO] verification failed on MD5 checksum for file: C:\Users\user.name\AppData\Local\Temp\common-1.2.1.jar8664794770384425218.zip
[INFO] testing for SHA1 checksum on artifact: com.jgoodies:common:1.2.1:jar
[INFO] ------------------------------------------------------------------------
[INFO] BUILD FAILURE
[INFO] ------------------------------------------------------------------------
[INFO] Total time: 2.117s
[INFO] Finished at: Tue May 21 20:40:09 BST 2013
[INFO] Final Memory: 4M/244M
[INFO] ------------------------------------------------------------------------
[ERROR] Failed to execute goal com.savage7.maven.plugins:maven-external-dependency-plugin:0.5:resolve-external (default-cli) on project pms: Both MD5 and SHA1 checksum verification failed for:
[ERROR] groupId : com.jgoodies
[ERROR] artifactId : common
[ERROR] version : 1.2.1
[ERROR] checksum : 5a4cf9866a7339e64e52f46101b5b13fe50b9c80
[ERROR] file : C:\Users\user.name\AppData\Local\Temp\common-1.2.1.jar8664794770384425218.zip
[ERROR] -> [Help 1]
[ERROR]
[ERROR] To see the full stack trace of the errors, re-run Maven with the -e switch.
[ERROR] Re-run Maven using the -X switch to enable full debug logging.
[ERROR]
[ERROR] For more information about the errors and possible solutions, please read the following articles:
[ERROR] [Help 1] http://cwiki.apache.org/confluence/disp ... eException
heavydawson
 
Posts: 6
Joined: Thu May 16, 2013 4:43 pm

Re: Issue 1391

Postby heavydawson » Tue May 21, 2013 8:49 pm

Quick update. I grabbed the latest snapshot jar based on the commit in Raptor's comment above and it appears to have fixed the issue!
Great news guys. Thanks!
heavydawson
 
Posts: 6
Joined: Thu May 16, 2013 4:43 pm

Re: Issue 1391

Postby Raptor399 » Wed May 22, 2013 5:40 pm

Glad it works for you, thanks for reporting back!
Raptor399
Project Member
 
Posts: 1916
Joined: Thu Mar 10, 2011 12:06 am

Previous

Return to General Help and Support

Who is online

Users browsing this forum: geb724, Google [Bot], Majestic-12 [Bot] and 11 guests