PMS Build Script

Discuss issues related to PS3 Media Server development (only for programmers)

Re: PMS Build Script

Postby vandal667 » Sun Aug 28, 2011 8:30 am

I tried your script on the workingpatch.patch located here: viewtopic.php?f=6&t=5235
Want to stream to my BD390 player. But it didn't work.

Help ?


BUILD FAILED

Code: Select all
C:\Program Files\PMS_Builder\build.xml:117: The following error occurred while
xecuting this line:
C:\Program Files\PMS_Builder\build.xml:123: java.io.IOException: Cannot run pro
ram "patch" (in directory "C:\Program Files\PMS_Builder\build\ps3mediaserver_pa
ched"): CreateProcess error=2, Systemet finner ikke angitt fil
        at java.lang.ProcessBuilder.start(ProcessBuilder.java:1029)
        at java.lang.Runtime.exec(Runtime.java:615)
        at org.apache.tools.ant.taskdefs.Execute$Java13CommandLauncher.exec(Exe
ute.java:827)
        at org.apache.tools.ant.taskdefs.Execute.launch(Execute.java:445)
        at org.apache.tools.ant.taskdefs.Execute.execute(Execute.java:459)
        at org.apache.tools.ant.taskdefs.Patch.execute(Patch.java:200)
        at org.apache.tools.ant.UnknownElement.execute(UnknownElement.java:291)
        at sun.reflect.GeneratedMethodAccessor4.invoke(Unknown Source)
        at sun.reflect.DelegatingMethodAccessorImpl.invoke(DelegatingMethodAcce
sorImpl.java:43)
        at java.lang.reflect.Method.invoke(Method.java:601)
        at org.apache.tools.ant.dispatch.DispatchUtils.execute(DispatchUtils.ja
a:106)
        at org.apache.tools.ant.Task.perform(Task.java:348)
        at org.apache.tools.ant.taskdefs.Sequential.execute(Sequential.java:68)
        at org.apache.tools.ant.UnknownElement.execute(UnknownElement.java:291)
        at sun.reflect.GeneratedMethodAccessor4.invoke(Unknown Source)
        at sun.reflect.DelegatingMethodAccessorImpl.invoke(DelegatingMethodAcce
sorImpl.java:43)
        at java.lang.reflect.Method.invoke(Method.java:601)
        at org.apache.tools.ant.dispatch.DispatchUtils.execute(DispatchUtils.ja
a:106)
        at org.apache.tools.ant.Task.perform(Task.java:348)
        at org.apache.tools.ant.taskdefs.MacroInstance.execute(MacroInstance.ja
a:398)
        at net.sf.antcontrib.logic.ForTask.doSequentialIteration(ForTask.java:2
9)
        at net.sf.antcontrib.logic.ForTask.doToken(ForTask.java:268)
        at net.sf.antcontrib.logic.ForTask.doTheTasks(ForTask.java:324)
        at net.sf.antcontrib.logic.ForTask.execute(ForTask.java:244)
        at org.apache.tools.ant.UnknownElement.execute(UnknownElement.java:291)
        at sun.reflect.GeneratedMethodAccessor4.invoke(Unknown Source)
        at sun.reflect.DelegatingMethodAccessorImpl.invoke(DelegatingMethodAcce
sorImpl.java:43)
        at java.lang.reflect.Method.invoke(Method.java:601)
        at org.apache.tools.ant.dispatch.DispatchUtils.execute(DispatchUtils.ja
a:106)
        at org.apache.tools.ant.Task.perform(Task.java:348)
        at org.apache.tools.ant.Target.execute(Target.java:390)
        at org.apache.tools.ant.Target.performTasks(Target.java:411)
        at org.apache.tools.ant.Project.executeSortedTargets(Project.java:1397)
        at org.apache.tools.ant.Project.executeTarget(Project.java:1366)
        at org.apache.tools.ant.helper.DefaultExecutor.executeTargets(DefaultEx
cutor.java:41)
        at org.apache.tools.ant.Project.executeTargets(Project.java:1249)
        at org.apache.tools.ant.Main.runBuild(Main.java:801)
        at org.apache.tools.ant.Main.startAnt(Main.java:218)
        at org.apache.tools.ant.launch.Launcher.run(Launcher.java:280)
        at org.apache.tools.ant.launch.Launcher.main(Launcher.java:109)
Caused by: java.io.IOException: CreateProcess error=2, Systemet finner ikke ang
tt fil
        at java.lang.ProcessImpl.create(Native Method)
        at java.lang.ProcessImpl.<init>(ProcessImpl.java:188)
        at java.lang.ProcessImpl.start(ProcessImpl.java:132)
        at java.lang.ProcessBuilder.start(ProcessBuilder.java:1021)
        ... 39 more
Last edited by chocolateboy on Sun Aug 28, 2011 12:40 pm, edited 1 time in total.
Reason: Reformatted
vandal667
 
Posts: 2
Joined: Sat Aug 27, 2011 8:10 am

Re: PMS Build Script

Postby innot » Thu Sep 01, 2011 10:00 am

vandal667 wrote:
Code: Select all
C:\Program Files\PMS_Builder\build.xml:117: The following error occurred while
xecuting this line:
C:\Program Files\PMS_Builder\build.xml:123: java.io.IOException: Cannot run pro
ram "patch" (in directory "C:\Program Files\PMS_Builder\build\ps3mediaserver_pa
ched"): CreateProcess error=2, Systemet finner ikke angitt fil


I don't know what "Systemet finner ikke angitt fil" means, but probably something like "System can't find program". Check that patch.exe exists and is executable where the script expects it, in your case in -> "C:\Program Files\PMS_Builder\build\ps3mediaserver_patched"

Thomas
innot
 
Posts: 8
Joined: Thu Jul 29, 2010 2:52 pm

Previous

Return to Developers

Who is online

Users browsing this forum: No registered users and 2 guests